Reaction Details
TargetB1 bradykinin receptor
LigandBDBM50184194
Substrate/Competitorn/a
Meas. Tech.ChEMBL_350972 (CHEMBL858907)
Ki 815±n/a nM
Citation Kuduk, SDDi Marco, CNChang, RKWood, MRKim, JJSchirripa, KMMurphy, KLRansom, RWTang, CTorrent, MHa, SPrueksaritanont, TPettibone, DJBock, MG 5-Piperazinyl pyridine carboxamide bradykinin B1 antagonists. Bioorg Med Chem Lett16:2791-5 (2006) 
 
B1 bradykinin receptor
Name:B1 bradykinin receptor
Type:Enzyme
Mol. Mass.:40508.87
Organism:Homo sapiens (Human)
Description:P46663
Residue:353
BDBM50184194
NameBDBM50184194
Synonyms:3,3'-difluoro-4'-(pyridin-2-ylaminomethyl)-biphenyl-2-carboxylic acid methyl ester | CHEMBL208538
TypeSmall organic molecule
Emp. Form.C20H16F2N2O2
Mol. Mass.354.35
SMILESCOC(=O)c1c(F)cccc1-c1ccc(CNc2ccccn2)c(F)c1