Reaction Details
TargetB1 bradykinin receptor
LigandBDBM50184204
Substrate/Competitorn/a
Meas. Tech.ChEMBL_350972 (CHEMBL858907)
Ki 1.7±n/a nM
Citation Kuduk, SDDi Marco, CNChang, RKWood, MRKim, JJSchirripa, KMMurphy, KLRansom, RWTang, CTorrent, MHa, SPrueksaritanont, TPettibone, DJBock, MG 5-Piperazinyl pyridine carboxamide bradykinin B1 antagonists. Bioorg Med Chem Lett16:2791-5 (2006) 
 
B1 bradykinin receptor
Name:B1 bradykinin receptor
Type:Enzyme
Mol. Mass.:40508.87
Organism:Homo sapiens (Human)
Description:P46663
Residue:353
BDBM50184204
NameBDBM50184204
Synonyms:3,3'-difluoro-4'-{[5-(4-propyl-piperazine-1-carbonyl)-pyridin-2-ylamino]-methyl}-biphenyl-2-carboxylic acid methyl ester | CHEMBL207378
TypeSmall organic molecule
Emp. Form.C28H30F2N4O3
Mol. Mass.508.5596
SMILESCCCN1CCN(CC1)C(=O)c1ccc(NCc2ccc(cc2F)-c2cccc(F)c2C(=O)OC)nc1