Reaction Details
TargetB1 bradykinin receptor
LigandBDBM50156455
Substrate/Competitorn/a
Meas. Tech.ChEMBL_350976 (CHEMBL858911)
Ki 0.038±n/a nM
Citation Kuduk, SDDi Marco, CNChang, RKWood, MRKim, JJSchirripa, KMMurphy, KLRansom, RWTang, CTorrent, MHa, SPrueksaritanont, TPettibone, DJBock, MG 5-Piperazinyl pyridine carboxamide bradykinin B1 antagonists. Bioorg Med Chem Lett16:2791-5 (2006) 
 
B1 bradykinin receptor
Name:B1 bradykinin receptor
Type:Enzyme
Mol. Mass.:40508.87
Organism:Homo sapiens (Human)
Description:P46663
Residue:353
BDBM50156455
NameBDBM50156455
Synonyms:(R)-N-(4-(4,5-dihydro-1H-imidazol-2-yl)phenethyl)-2-(1-(3,4-dichlorophenylsulfonyl)-3-oxo-1,2,3,4-tetrahydroquinoxalin-2-yl)acetamide CHEMBL189123
TypeSmall organic molecule
Emp. Form.C27H25Cl2N5O4S
Mol. Mass.586.49
SMILESClc1ccc(cc1Cl)S(=O)(=O)N1[C@H](CC(=O)NCCc2ccc(cc2)C2=NCCN2)C(=O)Nc2ccccc12