Reaction Details
TargetThromboxane A2 receptor
LigandBDBM50184229
Substrate/Competitorn/a
Meas. Tech.ChEMBL_364758 (CHEMBL871220)
Ki 140±n/a nM
Citation Sturino, CFLachance, NBoyd, MBerthelette, CLabelle, MLi, LRoy, BScheigetz, JTsou, NBrideau, CCauchon, ECarriere, MCDenis, DGreig, GKargman, SLamontagne, SMathieu, MCSawyer, NSlipetz, DO'Neill, GWang, ZZamboni, RMetters, KMYoung, RN Identification of an indole series of prostaglandin D2 receptor antagonists. Bioorg Med Chem Lett16:3043-8 (2006) 
 
Thromboxane A2 receptor
Name:Thromboxane A2 receptor
Type:Enyzme
Mol. Mass.:37445.28
Organism:Homo sapiens (Human)
Description:P21731
Residue:343
BDBM50184229
NameBDBM50184229
Synonyms:2-(9-(4-chlorobenzyl)-8-(benzylsulfinyl)-2,3,4,9-tetrahydro-1H-carbazol-1-yl)acetic acid | CHEMBL208083
TypeSmall organic molecule
Emp. Form.C28H26ClNO3S
Mol. Mass.492.029
SMILESOC(=O)CC1CCCc2c1n(Cc1ccc(Cl)cc1)c1c(cccc21)S(=O)Cc1ccccc1