Reaction Details
TargetProstaglandin D2 receptor
LigandBDBM50184235
Substrate/Competitorn/a
Meas. Tech.ChEMBL_364757 (CHEMBL871219)
Ki 3.5±n/a nM
Citation Sturino, CFLachance, NBoyd, MBerthelette, CLabelle, MLi, LRoy, BScheigetz, JTsou, NBrideau, CCauchon, ECarriere, MCDenis, DGreig, GKargman, SLamontagne, SMathieu, MCSawyer, NSlipetz, DO'Neill, GWang, ZZamboni, RMetters, KMYoung, RN Identification of an indole series of prostaglandin D2 receptor antagonists. Bioorg Med Chem Lett16:3043-8 (2006) 
 
Prostaglandin D2 receptor
Name:Prostaglandin D2 receptor
Type:Enzyme
Mol. Mass.:40288.87
Organism:Homo sapiens (Human)
Description:Q13258
Residue:359
BDBM50184235
NameBDBM50184235
Synonyms:2-(4-(3-chlorobenzyl)-5-bromo-7-(methylsulfonyl)-1,2,3,4-tetrahydrocyclopenta[b]indol-3-yl)acetic acid | CHEMBL210615
TypeSmall organic molecule
Emp. Form.C21H19BrClNO4S
Mol. Mass.496.802
SMILESCS(=O)(=O)c1cc(Br)c2n(Cc3cccc(Cl)c3)c3C(CC(O)=O)CCc3c2c1