Reaction Details
TargetProstaglandin D2 receptor
LigandBDBM50184238
Substrate/Competitorn/a
Meas. Tech.ChEMBL_364757 (CHEMBL871219)
Ki 2.8±n/a nM
Citation Sturino, CFLachance, NBoyd, MBerthelette, CLabelle, MLi, LRoy, BScheigetz, JTsou, NBrideau, CCauchon, ECarriere, MCDenis, DGreig, GKargman, SLamontagne, SMathieu, MCSawyer, NSlipetz, DO'Neill, GWang, ZZamboni, RMetters, KMYoung, RN Identification of an indole series of prostaglandin D2 receptor antagonists. Bioorg Med Chem Lett16:3043-8 (2006) 
 
Prostaglandin D2 receptor
Name:Prostaglandin D2 receptor
Type:Enzyme
Mol. Mass.:40288.87
Organism:Homo sapiens (Human)
Description:Q13258
Residue:359
BDBM50184238
NameBDBM50184238
Synonyms:2-(9-(4-chlorobenzyl)-8-(methylsulfinyl)-2,3,4,9-tetrahydro-1H-carbazol-1-yl)acetic acid | CHEMBL383224
TypeSmall organic molecule
Emp. Form.C22H22ClNO3S
Mol. Mass.415.933
SMILESCS(=O)c1cccc2c3CCCC(CC(O)=O)c3n(Cc3ccc(Cl)cc3)c12