Reaction Details
TargetThromboxane A2 receptor
LigandBDBM50184232
Substrate/Competitorn/a
Meas. Tech.ChEMBL_364758 (CHEMBL871220)
Ki 220±n/a nM
Citation Sturino, CFLachance, NBoyd, MBerthelette, CLabelle, MLi, LRoy, BScheigetz, JTsou, NBrideau, CCauchon, ECarriere, MCDenis, DGreig, GKargman, SLamontagne, SMathieu, MCSawyer, NSlipetz, DO'Neill, GWang, ZZamboni, RMetters, KMYoung, RN Identification of an indole series of prostaglandin D2 receptor antagonists. Bioorg Med Chem Lett16:3043-8 (2006) 
 
Thromboxane A2 receptor
Name:Thromboxane A2 receptor
Type:Enyzme
Mol. Mass.:37445.28
Organism:Homo sapiens (Human)
Description:P21731
Residue:343
BDBM50184232
NameBDBM50184232
Synonyms:2-(5-bromo-4-((2,3-dichlorothieno[3,2-b]pyridin-5-yl)methyl)-7-(methylsulfonyl)-1,2,3,4-tetrahydrocyclopenta[b]indol-3-yl)acetic acid | CHEMBL210744
TypeSmall organic molecule
Emp. Form.C22H17BrCl2N2O4S2
Mol. Mass.588.321
SMILESCS(=O)(=O)c1cc(Br)c2n(Cc3ccc4sc(Cl)c(Cl)c4n3)c3C(CC(O)=O)CCc3c2c1