Reaction Details
TargetThromboxane A2 receptor
LigandBDBM50184243
Substrate/Competitorn/a
Meas. Tech.ChEMBL_364758 (CHEMBL871220)
Ki 100±n/a nM
Citation Sturino, CFLachance, NBoyd, MBerthelette, CLabelle, MLi, LRoy, BScheigetz, JTsou, NBrideau, CCauchon, ECarriere, MCDenis, DGreig, GKargman, SLamontagne, SMathieu, MCSawyer, NSlipetz, DO'Neill, GWang, ZZamboni, RMetters, KMYoung, RN Identification of an indole series of prostaglandin D2 receptor antagonists. Bioorg Med Chem Lett16:3043-8 (2006) 
 
Thromboxane A2 receptor
Name:Thromboxane A2 receptor
Type:Enyzme
Mol. Mass.:37445.28
Organism:Homo sapiens (Human)
Description:P21731
Residue:343
BDBM50184243
NameBDBM50184243
Synonyms:CHEMBL207451 | [5-bromo-4-(4-chloro-benzyl)-7-dimethylsulfamoyl-1,2,3,4-tetrahydro-cyclopenta[b]indol-3-yl]-acetic acid
TypeSmall organic molecule
Emp. Form.C22H22BrClN2O4S
Mol. Mass.525.843
SMILESCN(C)S(=O)(=O)c1cc(Br)c2n(Cc3ccc(Cl)cc3)c3C(CC(O)=O)CCc3c2c1