Reaction Details
TargetProstaglandin D2 receptor
LigandBDBM50184220
Substrate/Competitorn/a
Meas. Tech.ChEMBL_364757 (CHEMBL871219)
Ki 3.6±n/a nM
Citation Sturino, CFLachance, NBoyd, MBerthelette, CLabelle, MLi, LRoy, BScheigetz, JTsou, NBrideau, CCauchon, ECarriere, MCDenis, DGreig, GKargman, SLamontagne, SMathieu, MCSawyer, NSlipetz, DO'Neill, GWang, ZZamboni, RMetters, KMYoung, RN Identification of an indole series of prostaglandin D2 receptor antagonists. Bioorg Med Chem Lett16:3043-8 (2006) 
 
Prostaglandin D2 receptor
Name:Prostaglandin D2 receptor
Type:Enzyme
Mol. Mass.:40288.87
Organism:Homo sapiens (Human)
Description:Q13258
Residue:359
BDBM50184220
NameBDBM50184220
Synonyms:2-(4-(4-chlorobenzyl)-7-(methylsulfonyl)-5-vinyl-1,2,3,4-tetrahydrocyclopenta[b]indol-3-yl)acetic acid | CHEMBL377055
TypeSmall organic molecule
Emp. Form.C23H22ClNO4S
Mol. Mass.443.943
SMILESCS(=O)(=O)c1cc(C=C)c2n(Cc3ccc(Cl)cc3)c3C(CC(O)=O)CCc3c2c1