Reaction Details
TargetNuclear receptor subfamily 1 group I member 2
LigandBDBM50184257
Substrate/Competitorn/a
Meas. Tech.ChEMBL_364838 (CHEMBL870189)
IC50>10000±n/a nM
Citation Szewczyk, JWHuang, SChin, JTian, JMitnaul, LRosa, RLPeterson, LSparrow, CPAdams, AD SAR studies: designing potent and selective LXR agonists. Bioorg Med Chem Lett16:3055-60 (2006) 
 
Nuclear receptor subfamily 1 group I member 2
Name:Nuclear receptor subfamily 1 group I member 2
Type:Nuclear receptor
Mol. Mass.:49774.77
Organism:Homo sapiens (Human)
Description:O75469
Residue:434
BDBM50184257
NameBDBM50184257
Synonyms:2-(2-oxo-1-(3-(7-propyl-3-(trifluoromethyl)benzo[d]isoxazol-6-yloxy)propyl)indolin-5-yl)acetic acid | CHEMBL207690
TypeSmall organic molecule
Emp. Form.C24H23F3N2O5
Mol. Mass.476.445
SMILESCCCc1c(OCCCN2C(=O)Cc3cc(CC(O)=O)ccc23)ccc2c(noc12)C(F)(F)F