Reaction Details
TargetMelanocortin receptor 3
LigandBDBM50184363
Substrate/Competitorn/a
Meas. Tech.ChEMBL_338132 (CHEMBL867659)
IC50 140±n/a nM
Citation Mayorov, AVCai, MChandler, KBPetrov, RRVan Scoy, ARYu, ZTanaka, DKTrivedi, DHruby, VJ Development of cyclic gamma-MSH analogues with selective hMC3R agonist and hMC3R/hMC5R antagonist activities. J Med Chem49:1946-52 (2006) 
 
Melanocortin receptor 3
Name:Melanocortin receptor 3
Type:Enzyme
Mol. Mass.:36044.86
Organism:Homo sapiens (Human)
Description:P41968
Residue:323
BDBM50184363
NameBDBM50184363
Synonyms:CHEMBL263822 | c[Nle-Arg-D-Phe-Arg-Trp-Glu]-NH2
TypeSmall organic molecule
Emp. Form.C43H62N14O7
Mol. Mass.887.042
SMILESCCCC[C@@H]1NC(=O)CC[C@H](NC(=O)[C@H](Cc2c[nH]c3ccccc23)NC(=O)[C@H](CCCN=C(N)N)NC(=O)[C@@H](Cc2ccccc2)NC(=O)[C@@H](CCCN=C(N)N)NC1=O)C(N)=O