Reaction Details
TargetMelanocortin receptor 5
LigandBDBM50184360
Substrate/Competitorn/a
Meas. Tech.ChEMBL_338134 (CHEMBL867662)
IC50 3.8±n/a nM
Citation Mayorov, AVCai, MChandler, KBPetrov, RRVan Scoy, ARYu, ZTanaka, DKTrivedi, DHruby, VJ Development of cyclic gamma-MSH analogues with selective hMC3R agonist and hMC3R/hMC5R antagonist activities. J Med Chem49:1946-52 (2006) 
 
Melanocortin receptor 5
Name:Melanocortin receptor 5
Type:Enzyme
Mol. Mass.:36612.92
Organism:Homo sapiens (Human)
Description:P33032
Residue:325
BDBM50184360
NameBDBM50184360
Synonyms:CHEMBL204864 | c[Nle-Nle-D-Nal(2')-Arg-Trp-Glu]-NH2
TypeSmall organic molecule
Emp. Form.C47H63N11O7
Mol. Mass.894.0726
SMILESCCCC[C@@H]1NC(=O)CC[C@H](NC(=O)[C@H](Cc2c[nH]c3ccccc23)NC(=O)[C@H](CCCN=C(N)N)NC(=O)[C@@H](Cc2ccc3ccccc3c2)NC(=O)[C@H](CCCC)NC1=O)C(N)=O