Reaction Details
TargetMelanocortin receptor 5
LigandBDBM50184356
Substrate/Competitorn/a
Meas. Tech.ChEMBL_338134 (CHEMBL867662)
IC50 2.3±n/a nM
Citation Mayorov, AVCai, MChandler, KBPetrov, RRVan Scoy, ARYu, ZTanaka, DKTrivedi, DHruby, VJ Development of cyclic gamma-MSH analogues with selective hMC3R agonist and hMC3R/hMC5R antagonist activities. J Med Chem49:1946-52 (2006) 
 
Melanocortin receptor 5
Name:Melanocortin receptor 5
Type:Enzyme
Mol. Mass.:36612.92
Organism:Homo sapiens (Human)
Description:P33032
Residue:325
BDBM50184356
NameBDBM50184356
Synonyms:CHEMBL425591 | c[Nle-His-D-Nal(2')-Arg-Trp-Glu]-NH2
TypeSmall organic molecule
Emp. Form.C47H59N13O7
Mol. Mass.918.0543
SMILESCCCC[C@@H]1NC(=O)CC[C@H](NC(=O)[C@H](Cc2c[nH]c3ccccc23)NC(=O)[C@H](CCCN=C(N)N)NC(=O)[C@@H](Cc2ccc3ccccc3c2)NC(=O)[C@H](Cc2cnc[nH]2)NC1=O)C(N)=O