Reaction Details
TargetProtein kinase C alpha type
LigandBDBM50184389
Substrate/Competitorn/a
Meas. Tech.ChEMBL_338717 (CHEMBL860607)
Ki 173±n/a nM
Citation Lee, JKang, JHHan, KCKim, YKim, SYYoun, HSMook-Jung, IKim, HLo Han, JHHa, HJKim, YHMarquez, VELewin, NEPearce, LVLundberg, DJBlumberg, PM Branched diacylglycerol-lactones as potent protein kinase C ligands and alpha-secretase activators. J Med Chem49:2028-36 (2006) 
 
Protein kinase C alpha type
Name:Protein kinase C alpha type
Type:Enzyme
Mol. Mass.:76755.65
Organism:Homo sapiens (Human)
Description:The recombinant human PKC enzymes were produced using a baculovirus expression system in SF9 cells
Residue:672
BDBM50184389
NameBDBM50184389
Synonyms:5-[(E)-3-(tert-butoxy)-3-oxo-1-propenyl]-5-hydroxymethyl-3-[(E)-3-isobutyl-5-methylhexylidene]tetrahydro-2-furanone | CHEMBL381693
TypeSmall organic molecule
Emp. Form.C23H38O5
Mol. Mass.394.5448
SMILESCC(C)CC(C\C=C1/CC(CO)(OC1=O)\C=C\C(=O)OC(C)(C)C)CC(C)C