Reaction Details
TargetProtein kinase C alpha type
LigandBDBM50184383
Substrate/Competitorn/a
Meas. Tech.ChEMBL_338717 (CHEMBL860607)
Ki 16±n/a nM
Citation Lee, JKang, JHHan, KCKim, YKim, SYYoun, HSMook-Jung, IKim, HLo Han, JHHa, HJKim, YHMarquez, VELewin, NEPearce, LVLundberg, DJBlumberg, PM Branched diacylglycerol-lactones as potent protein kinase C ligands and alpha-secretase activators. J Med Chem49:2028-36 (2006) 
 
Protein kinase C alpha type
Name:Protein kinase C alpha type
Type:Enzyme
Mol. Mass.:76755.65
Organism:Homo sapiens (Human)
Description:The recombinant human PKC enzymes were produced using a baculovirus expression system in SF9 cells
Residue:672
BDBM50184383
NameBDBM50184383
Synonyms:5-benzoyloxymethyl-5-hydroxymethyl-3-[(E)-3-isobutyl-5-methylhexylidene]tetrahydro-2-furanone | CHEMBL380661
TypeSmall organic molecule
Emp. Form.C24H34O5
Mol. Mass.402.5238
SMILESCC(C)CC(C\C=C1/CC(CO)(COC(=O)c2ccccc2)OC1=O)CC(C)C