Reaction Details
TargetProtein kinase C alpha type
LigandBDBM50184386
Substrate/Competitorn/a
Meas. Tech.ChEMBL_338717 (CHEMBL860607)
Ki 129±n/a nM
Citation Lee, JKang, JHHan, KCKim, YKim, SYYoun, HSMook-Jung, IKim, HLo Han, JHHa, HJKim, YHMarquez, VELewin, NEPearce, LVLundberg, DJBlumberg, PM Branched diacylglycerol-lactones as potent protein kinase C ligands and alpha-secretase activators. J Med Chem49:2028-36 (2006) 
 
Protein kinase C alpha type
Name:Protein kinase C alpha type
Type:Enzyme
Mol. Mass.:76755.65
Organism:Homo sapiens (Human)
Description:The recombinant human PKC enzymes were produced using a baculovirus expression system in SF9 cells
Residue:672
BDBM50184386
NameBDBM50184386
Synonyms:6-hydroxymethyl-3-[(E)-3-isobutyl-5-methylhexylidene]-6-octanoyloxymethyl-tetrahydro-2-pyranone | CHEMBL205248
TypeSmall organic molecule
Emp. Form.C26H46O5
Mol. Mass.438.6404
SMILESCCCCCCCC(=O)OCC1(CO)CC\C(=C/CC(CC(C)C)CC(C)C)C(=O)O1