Reaction Details
TargetProtein kinase C alpha type
LigandBDBM50184385
Substrate/Competitorn/a
Meas. Tech.ChEMBL_338717 (CHEMBL860607)
Ki 5±n/a nM
Citation Lee, JKang, JHHan, KCKim, YKim, SYYoun, HSMook-Jung, IKim, HLo Han, JHHa, HJKim, YHMarquez, VELewin, NEPearce, LVLundberg, DJBlumberg, PM Branched diacylglycerol-lactones as potent protein kinase C ligands and alpha-secretase activators. J Med Chem49:2028-36 (2006) 
 
Protein kinase C alpha type
Name:Protein kinase C alpha type
Type:Enzyme
Mol. Mass.:76755.65
Organism:Homo sapiens (Human)
Description:The recombinant human PKC enzymes were produced using a baculovirus expression system in SF9 cells
Residue:672
BDBM50184385
NameBDBM50184385
Synonyms:5-hydroxymethyl-3-[(Z)-3-isobutyl-5-methylhexylidene]-5-octanoyloxymethyltetrahydro-2-furanone | CHEMBL206332
TypeSmall organic molecule
Emp. Form.C25H44O5
Mol. Mass.424.6139
SMILESCCCCCCCC(=O)OCC1(CO)C\C(=C\CC(CC(C)C)CC(C)C)C(=O)O1