Reaction Details
TargetProtein kinase C alpha type
LigandBDBM50107118
Substrate/Competitorn/a
Meas. Tech.ChEMBL_338717 (CHEMBL860607)
Ki 4.5±n/a nM
Citation Lee, JKang, JHHan, KCKim, YKim, SYYoun, HSMook-Jung, IKim, HLo Han, JHHa, HJKim, YHMarquez, VELewin, NEPearce, LVLundberg, DJBlumberg, PM Branched diacylglycerol-lactones as potent protein kinase C ligands and alpha-secretase activators. J Med Chem49:2028-36 (2006) 
 
Protein kinase C alpha type
Name:Protein kinase C alpha type
Type:Enzyme
Mol. Mass.:76755.65
Organism:Homo sapiens (Human)
Description:The recombinant human PKC enzymes were produced using a baculovirus expression system in SF9 cells
Residue:672
BDBM50107118
NameBDBM50107118
Synonyms:3-Isopropyl-4-methyl-pentanoic acid 2-hydroxymethyl-4-(3-isobutyl-5-methyl-hexylidene)-5-oxo-tetrahydro-furan-2-ylmethyl ester CHEMBL138171
TypeSmall organic molecule
Emp. Form.C26H46O5
Mol. Mass.438.6404
SMILESCC(C)CC(C\C=C1/CC(CO)(COC(=O)CC(C(C)C)C(C)C)OC1=O)CC(C)C