Reaction Details
TargetC-C chemokine receptor type 5
LigandBDBM50184400
Substrate/Competitorn/a
Meas. Tech.ChEMBL_338784 (CHEMBL860618)
IC50 6.8±n/a nM
Citation Seto, MAikawa, KMiyamoto, NAramaki, YKanzaki, NTakashima, KKuze, YIizawa, YBaba, MShiraishi, M Highly potent and orally active CCR5 antagonists as anti-HIV-1 agents: synthesis and biological activities of 1-benzazocine derivatives containing a sulfoxide moiety. J Med Chem49:2037-48 (2006) 
 
C-C chemokine receptor type 5
Name:C-C chemokine receptor type 5
Type:Enzyme
Mol. Mass.:40540.21
Organism:Homo sapiens (Human)
Description:P51681
Residue:352
BDBM50184400
NameBDBM50184400
Synonyms:(S)-(-)-9-{4-[2-(butoxy)ethoxy]phenyl}-1-isobutyl-N-(4-{[(1-propyl-1H-imidazol-5-yl)methyl]sulfinyl}phenyl)-2,3,4,5-tetrahydro-1H-1-benzazonine-6-carboxamide | CHEMBL437302
TypeSmall organic molecule
Emp. Form.C42H54N4O4S
Mol. Mass.710.968
SMILESCCCCOCCOc1ccc(cc1)-c1ccc2N(CC(C)C)CCCCC(=Cc2c1)C(=O)Nc1ccc(cc1)S(=O)Cc1cncn1CCC