Reaction Details
TargetC-C chemokine receptor type 5
LigandBDBM50184399
Substrate/Competitorn/a
Meas. Tech.ChEMBL_338784 (CHEMBL860618)
IC50 1.7±n/a nM
Citation Seto, MAikawa, KMiyamoto, NAramaki, YKanzaki, NTakashima, KKuze, YIizawa, YBaba, MShiraishi, M Highly potent and orally active CCR5 antagonists as anti-HIV-1 agents: synthesis and biological activities of 1-benzazocine derivatives containing a sulfoxide moiety. J Med Chem49:2037-48 (2006) 
 
C-C chemokine receptor type 5
Name:C-C chemokine receptor type 5
Type:Enzyme
Mol. Mass.:40540.21
Organism:Homo sapiens (Human)
Description:P51681
Residue:352
BDBM50184399
NameBDBM50184399
Synonyms:(S)-(-)-8-{4-[2-(butoxy)ethoxy]phenyl}-1-[(1-methyl-1H-pyrazol-4-yl)methyl]-N-(4-{[(1-propyl-1H-imidazol-5-yl)methyl]-sulfinyl}phenyl)-1,2,3,4-tetrahydro-1-benzazocine-5-carboxamide | CHEMBL204743
TypeSmall organic molecule
Emp. Form.C42H50N6O4S
Mol. Mass.734.949
SMILESCCCCOCCOc1ccc(cc1)-c1ccc2N(Cc3cnn(C)c3)CCCC(=Cc2c1)C(=O)Nc1ccc(cc1)S(=O)Cc1cncn1CCC