Reaction Details
TargetD(1B) dopamine receptor
LigandBDBM50184428
Substrate/Competitorn/a
Meas. Tech.ChEMBL_337504 (CHEMBL861438)
Ki 0.057±n/a nM
Citation Mohr, PDecker, MEnzensperger, CLehmann, J Dopamine/serotonin receptor ligands. 12(1): SAR studies on hexahydro-dibenz[d,g]azecines lead to 4-chloro-7-methyl-5,6,7,8,9,14-hexahydrodibenz[d,g]azecin-3-ol, the first picomolar D5-selective dopamine-receptor antagonist. J Med Chem49:2110-6 (2006) 
 
D(1B) dopamine receptor
Name:D(1B) dopamine receptor
Type:Protein
Mol. Mass.:52943.41
Organism:Homo sapiens (Human)
Description:P21918
Residue:477
BDBM50184428
NameBDBM50184428
Synonyms:4-Chloro-3-hydroxy-7-methyl-5,6,7,8,9,14-hexahydrodibenzo[d,g]azecine CHEMBL203637
TypeSmall organic molecule
Emp. Form.C18H20ClNO
Mol. Mass.301.811
SMILESCN1CCc2ccccc2Cc2ccc(O)c(Cl)c2CC1