Reaction Details
TargetMitogen-activated protein kinase kinase kinase 20
LigandBDBM50184487
Substrate/Competitorn/a
Meas. Tech.ChEMBL_337604 (CHEMBL861565)
IC50 8480±n/a nM
Citation Li, HYWang, YHeap, CRKing, CHMundla, SRVoss, MClawson, DKYan, LCampbell, RMAnderson, BDWagner, JRBritt, KLu, KXMcMillen, WTYingling, JM Dihydropyrrolopyrazole transforming growth factor-beta type I receptor kinase domain inhibitors: a novel benzimidazole series with selectivity versus transforming growth factor-beta type II receptor kinase and mixed lineage kinase-7. J Med Chem49:2138-42 (2006) 
 
Mitogen-activated protein kinase kinase kinase 20
Name:Mitogen-activated protein kinase kinase kinase 20
Type:PROTEIN
Mol. Mass.:91168.58
Organism:Homo sapiens (Human)
Description:ChEMBL_1495629
Residue:800
BDBM50184487
NameBDBM50184487
Synonyms:4-(3-(6-(2-(6-methylpyridin-2-yl)-5,6-dihydro-4H-pyrrolo[1,2-b]pyrazol-3-yl)-1H-benzo[d]imidazol-1-yl)propyl)morpholine CHEMBL381532
TypeSmall organic molecule
Emp. Form.C26H30N6O
Mol. Mass.442.556
SMILESCc1cccc(n1)-c1nn2CCCc2c1-c1ccc2ncn(CCCN3CCOCC3)c2c1