Reaction Details
TargetMitogen-activated protein kinase kinase kinase 20
LigandBDBM21492
Substrate/Competitorn/a
Meas. Tech.ChEMBL_337604 (CHEMBL861565)
IC50 1400±n/a nM
Citation Li, HYWang, YHeap, CRKing, CHMundla, SRVoss, MClawson, DKYan, LCampbell, RMAnderson, BDWagner, JRBritt, KLu, KXMcMillen, WTYingling, JM Dihydropyrrolopyrazole transforming growth factor-beta type I receptor kinase domain inhibitors: a novel benzimidazole series with selectivity versus transforming growth factor-beta type II receptor kinase and mixed lineage kinase-7. J Med Chem49:2138-42 (2006) 
 
Mitogen-activated protein kinase kinase kinase 20
Name:Mitogen-activated protein kinase kinase kinase 20
Type:PROTEIN
Mol. Mass.:91168.58
Organism:Homo sapiens (Human)
Description:ChEMBL_1495629
Residue:800
BDBM21492
NameBDBM21492
Synonyms:4-[3-(pyridin-2-yl)-1H-pyrazol-4-yl]quinoline LY364947 US9138393, LY-364947 | US9144538, LY-364947
TypeSmall organic molecule
Emp. Form.C17H12N4
Mol. Mass.272.304
SMILESc1[nH]nc(c1-c1ccnc2ccccc12)-c1ccccn1