Reaction Details
TargetC-X-C chemokine receptor type 2
LigandBDBM50184516
Substrate/Competitorn/a
Meas. Tech.ChEMBL_355078 (CHEMBL870125)
Ki 57±n/a nM
Citation Ho, KKAuld, DSBohnstedt, ACConti, PDokter, WErickson, SFeng, DInglese, JKingsbury, CKultgen, SGLiu, RQMasterson, CMOhlmeyer, MRong, YRooseboom, MRoughton, ASamama, PSmit, MJSon, Evan der Louw, JVogel, GWebb, MWijkmans, JYou, M Imidazolylpyrimidine based CXCR2 chemokine receptor antagonists. Bioorg Med Chem Lett16:2724-8 (2006) 
 
C-X-C chemokine receptor type 2
Name:C-X-C chemokine receptor type 2
Type:Protein
Mol. Mass.:40767.88
Organism:Homo sapiens (Human)
Description:P25025
Residue:360
BDBM50184516
NameBDBM50184516
Synonyms:(2S)-N-(3-ethoxypropyl)-2-(6-ethyl-2-(4-(4-(trifluoromethoxy)phenyl)-1H-imidazol-1-yl)pyrimidin-4-ylamino)-4-methylpentanamide | CHEMBL206987
TypeSmall organic molecule
Emp. Form.C27H35F3N6O3
Mol. Mass.548.6004
SMILESCCOCCCNC(=O)[C@H](CC(C)C)Nc1cc(CC)nc(n1)-n1cnc(c1)-c1ccc(OC(F)(F)F)cc1