Reaction Details
TargetC-X-C chemokine receptor type 2
LigandBDBM50184532
Substrate/Competitorn/a
Meas. Tech.ChEMBL_355078 (CHEMBL870125)
Ki 85±n/a nM
Citation Ho, KKAuld, DSBohnstedt, ACConti, PDokter, WErickson, SFeng, DInglese, JKingsbury, CKultgen, SGLiu, RQMasterson, CMOhlmeyer, MRong, YRooseboom, MRoughton, ASamama, PSmit, MJSon, Evan der Louw, JVogel, GWebb, MWijkmans, JYou, M Imidazolylpyrimidine based CXCR2 chemokine receptor antagonists. Bioorg Med Chem Lett16:2724-8 (2006) 
 
C-X-C chemokine receptor type 2
Name:C-X-C chemokine receptor type 2
Type:Protein
Mol. Mass.:40767.88
Organism:Homo sapiens (Human)
Description:P25025
Residue:360
BDBM50184532
NameBDBM50184532
Synonyms:(2S)-2-(6-butyl-2-(4-tert-butyl-1H-imidazol-1-yl)pyrimidin-4-ylamino)-N-(3-ethoxypropyl)-4-methylpentanamide | CHEMBL382377
TypeSmall organic molecule
Emp. Form.C26H44N6O2
Mol. Mass.472.6666
SMILESCCCCc1cc(N[C@@H](CC(C)C)C(=O)NCCCOCC)nc(n1)-n1cnc(c1)C(C)(C)C