Reaction Details
TargetC-X-C chemokine receptor type 2
LigandBDBM50184538
Substrate/Competitorn/a
Meas. Tech.ChEMBL_355078 (CHEMBL870125)
Ki 290±n/a nM
Citation Ho, KKAuld, DSBohnstedt, ACConti, PDokter, WErickson, SFeng, DInglese, JKingsbury, CKultgen, SGLiu, RQMasterson, CMOhlmeyer, MRong, YRooseboom, MRoughton, ASamama, PSmit, MJSon, Evan der Louw, JVogel, GWebb, MWijkmans, JYou, M Imidazolylpyrimidine based CXCR2 chemokine receptor antagonists. Bioorg Med Chem Lett16:2724-8 (2006) 
 
C-X-C chemokine receptor type 2
Name:C-X-C chemokine receptor type 2
Type:Protein
Mol. Mass.:40767.88
Organism:Homo sapiens (Human)
Description:P25025
Residue:360
BDBM50184538
NameBDBM50184538
Synonyms:(2S)-N-(3-ethoxypropyl)-2-(6-hexyl-2-(1H-imidazol-1-yl)pyrimidin-4-ylamino)-4-methylpentanamide | CHEMBL379836
TypeSmall organic molecule
Emp. Form.C24H40N6O2
Mol. Mass.444.6134
SMILESCCCCCCc1cc(N[C@@H](CC(C)C)C(=O)NCCCOCC)nc(n1)-n1ccnc1