Reaction Details
TargetDNA polymerase alpha catalytic subunit
LigandBDBM50184752
Substrate/Competitorn/a
Meas. Tech.ChEMBL_356787 (CHEMBL861140)
IC50 3300±n/a nM
Citation Doncaster, JREtchells, LLKershaw, NMNakamura, RRyan, HTakeuchi, RSakaguchi, KSardarian, AWhitehead, RC Synthetic analogues of the manzamenones and plakoridines which inhibit DNA polymerase. Bioorg Med Chem Lett16:2877-81 (2006) 
 
DNA polymerase alpha catalytic subunit
Name:DNA polymerase alpha catalytic subunit
Type:PROTEIN
Mol. Mass.:165895.25
Organism:Homo sapiens (Human)
Description:ChEMBL_1365493
Residue:1462
BDBM50184752
NameBDBM50184752
Synonyms:(3aS,4S,7R,7aR)-1,6-dihexadecyl-2,7-bis(isopropoxycarbonyl)-3-oxo-3a,4,7,7a-tetrahydro-3H-indene-4-carboxylic acid | CHEMBL210096
TypeSmall organic molecule
Emp. Form.C50H86O7
Mol. Mass.799.2136
1=C(C(=O)OC(C)C)C(=O)[C@H]2[C@@H]1[C@@H](C(=O)OC(C)C)C(CCCCCCCCCCCCCCCC)=C[C@@H]2C(O)=O