Reaction Details
TargetDNA polymerase beta
LigandBDBM50184755
Substrate/Competitorn/a
Meas. Tech.ChEMBL_356788 (CHEMBL861141)
IC50 3200±n/a nM
Citation Doncaster, JREtchells, LLKershaw, NMNakamura, RRyan, HTakeuchi, RSakaguchi, KSardarian, AWhitehead, RC Synthetic analogues of the manzamenones and plakoridines which inhibit DNA polymerase. Bioorg Med Chem Lett16:2877-81 (2006) 
 
DNA polymerase beta
Name:DNA polymerase beta
Type:Protein
Mol. Mass.:38188.76
Organism:Homo sapiens (Human)
Description:n/a
Residue:335
BDBM50184755
NameBDBM50184755
Synonyms:(3aS,4S,7R,7aR)-1,6-dihexadecyl-2,7-bis(methoxycarbonyl)-3-oxo-3a,4,7,7a-tetrahydro-3H-indene-4-carboxylic acid | CHEMBL380892
TypeSmall organic molecule
Emp. Form.C46H78O7
Mol. Mass.743.1073
1=C(C(=O)OC)C(=O)[C@H]2[C@@H]1[C@@H](C(=O)OC)C(CCCCCCCCCCCCCCCC)=C[C@@H]2C(O)=O