Reaction Details
TargetDNA polymerase alpha catalytic subunit
LigandBDBM50184756
Substrate/Competitorn/a
Meas. Tech.ChEMBL_356787 (CHEMBL861140)
IC50 3500±n/a nM
Citation Doncaster, JREtchells, LLKershaw, NMNakamura, RRyan, HTakeuchi, RSakaguchi, KSardarian, AWhitehead, RC Synthetic analogues of the manzamenones and plakoridines which inhibit DNA polymerase. Bioorg Med Chem Lett16:2877-81 (2006) 
 
DNA polymerase alpha catalytic subunit
Name:DNA polymerase alpha catalytic subunit
Type:PROTEIN
Mol. Mass.:165895.25
Organism:Homo sapiens (Human)
Description:ChEMBL_1365493
Residue:1462
BDBM50184756
NameBDBM50184756
Synonyms:(3aR,4S,7S,7aS)-7-ethyl 2,4-dimethyl 3,5-dihexadecyl-1-oxo-3a,4,7,7a-tetrahydro-1H-indene-2,4,7-tricarboxylate | CHEMBL380026
TypeSmall organic molecule
Emp. Form.C48H82O7
Mol. Mass.771.1605
1=C(C(=O)OC)C(=O)[C@H]2[C@@H]1[C@H](C(=O)OC)C(CCCCCCCCCCCCCCCC)=C[C@@H]2C(=O)OCC