Reaction Details
TargetDNA polymerase alpha catalytic subunit
LigandBDBM50184759
Substrate/Competitorn/a
Meas. Tech.ChEMBL_356787 (CHEMBL861140)
IC50 21000±n/a nM
Citation Doncaster, JREtchells, LLKershaw, NMNakamura, RRyan, HTakeuchi, RSakaguchi, KSardarian, AWhitehead, RC Synthetic analogues of the manzamenones and plakoridines which inhibit DNA polymerase. Bioorg Med Chem Lett16:2877-81 (2006) 
 
DNA polymerase alpha catalytic subunit
Name:DNA polymerase alpha catalytic subunit
Type:PROTEIN
Mol. Mass.:165895.25
Organism:Homo sapiens (Human)
Description:ChEMBL_1365493
Residue:1462
BDBM50184759
NameBDBM50184759
Synonyms:(2R,3S,4R)-methyl 1-(2-(1H-indol-3-yl)ethyl)-4-hydroxy-5-(2-oxotetradecylidene)-2-phenylpyrrolidine-3-carboxylate | CHEMBL437310
TypeSmall organic molecule
Emp. Form.C36H48N2O4
Mol. Mass.572.7773
SMILESCCCCCCCCCCCCC(=O)C=C1[C@H](O)[C@H]([C@@H](N1CCc1c[nH]c2ccccc12)c1ccccc1)C(=O)OC