Reaction Details
TargetDNA polymerase beta
LigandBDBM50184762
Substrate/Competitorn/a
Meas. Tech.ChEMBL_356788 (CHEMBL861141)
IC50 179000±n/a nM
Citation Doncaster, JREtchells, LLKershaw, NMNakamura, RRyan, HTakeuchi, RSakaguchi, KSardarian, AWhitehead, RC Synthetic analogues of the manzamenones and plakoridines which inhibit DNA polymerase. Bioorg Med Chem Lett16:2877-81 (2006) 
 
DNA polymerase beta
Name:DNA polymerase beta
Type:Protein
Mol. Mass.:38188.76
Organism:Homo sapiens (Human)
Description:n/a
Residue:335
BDBM50184762
NameBDBM50184762
Synonyms:CHEMBL210842 | plakevulin A
TypeSmall organic molecule
Emp. Form.C23H42O4
Mol. Mass.382.5772
[C@]1(O)C=C[C@H](O)[C@H]1C(=O)OC