Reaction Details
TargetCytochrome P450 3A4
LigandBDBM50184818
Substrate/Competitorn/a
Meas. Tech.ChEMBL_342118 (CHEMBL859789)
IC50 1000±n/a nM
Citation Bhide, RSCai, ZWZhang, YZQian, LWei, DBarbosa, SLombardo, LJBorzilleri, RMZheng, XWu, LIBarrish, JCKim, SHLeavitt, KMathur, ALeith, LChao, SWautlet, BMortillo, SJeyaseelan, RKukral, DHunt, JTKamath, AFura, AVyas, VMarathe, PD'Arienzo, CDerbin, GFargnoli, J Discovery and preclinical studies of (R)-1-(4-(4-fluoro-2-methyl-1H-indol-5-yloxy)-5- methylpyrrolo[2,1-f][1,2,4]triazin-6-yloxy)propan- 2-ol (BMS-540215), an in vivo active potent VEGFR-2 inhibitor. J Med Chem49:2143-6 (2006) 
 
Cytochrome P450 3A4
Name:Cytochrome P450 3A4
Type:Enzyme
Mol. Mass.:57349.57
Organism:Homo sapiens (Human)
Description:n/a
Residue:503
BDBM50184818
NameBDBM50184818
Synonyms:4-(4-fluoro-2-methyl-1H-indol-5-yloxy)-5-methyl-6-(3-(piperidin-1-yl)propoxy)pyrrolo[2,1-f][1,2,4]triazine | CHEMBL205142
TypeSmall organic molecule
Emp. Form.C24H28FN5O2
Mol. Mass.437.5098
SMILESCc1cc2c(F)c(Oc3ncnn4cc(OCCCN5CCCCC5)c(C)c34)ccc2[nH]1