Reaction Details
TargetVascular endothelial growth factor receptor 2
LigandBDBM50184813
Substrate/Competitorn/a
Meas. Tech.ChEMBL_342115 (CHEMBL860941)
IC50 42±n/a nM
Citation Bhide, RSCai, ZWZhang, YZQian, LWei, DBarbosa, SLombardo, LJBorzilleri, RMZheng, XWu, LIBarrish, JCKim, SHLeavitt, KMathur, ALeith, LChao, SWautlet, BMortillo, SJeyaseelan, RKukral, DHunt, JTKamath, AFura, AVyas, VMarathe, PD'Arienzo, CDerbin, GFargnoli, J Discovery and preclinical studies of (R)-1-(4-(4-fluoro-2-methyl-1H-indol-5-yloxy)-5- methylpyrrolo[2,1-f][1,2,4]triazin-6-yloxy)propan- 2-ol (BMS-540215), an in vivo active potent VEGFR-2 inhibitor. J Med Chem49:2143-6 (2006) 
 
Vascular endothelial growth factor receptor 2
Name:Vascular endothelial growth factor receptor 2
Type:Receptor Tyrosine Kinase
Mol. Mass.:151510.97
Organism:Homo sapiens (Human)
Description:P35968
Residue:1356
BDBM50184813
NameBDBM50184813
Synonyms:(R)-1-(4-(4-fluoro-2-methyl-1H-indol-5-yloxy)-5-methylpyrrolo[2,1-f][1,2,4]triazin-6-yloxy)-3-methoxypropan-2-ol | CHEMBL205710
TypeSmall organic molecule
Emp. Form.C20H21FN4O4
Mol. Mass.400.4035
SMILESCOC[C@@H](O)COc1cn2ncnc(Oc3ccc4[nH]c(C)cc4c3F)c2c1C