Reaction Details
TargetPeptidyl-prolyl cis-trans isomerase NIMA-interacting 1
LigandBDBM50184825
Substrate/Competitorn/a
Meas. Tech.ChEMBL_342610 (CHEMBL861259)
Ki 1.2±n/a nM
Citation Wildemann, DErdmann, FAlvarez, BHStoller, GZhou, XZFanghänel, JSchutkowski, MLu, KPFischer, G Nanomolar inhibitors of the peptidyl prolyl cis/trans isomerase Pin1 from combinatorial peptide libraries. J Med Chem49:2147-50 (2006) 
 
Peptidyl-prolyl cis-trans isomerase NIMA-interacting 1
Name:Peptidyl-prolyl cis-trans isomerase NIMA-interacting 1
Type:PROTEIN
Mol. Mass.:18248.11
Organism:Homo sapiens (Human)
Description:ChEMBL_1502595
Residue:163
BDBM50184825
NameBDBM50184825
Synonyms:Ac-Lys(N-epsilon-biotinoyl)-Ala-Ala-Bth-D-Thr(PO3H2)-Pip-Nal-Gln-NH2 | CHEMBL219531
TypeSmall organic molecule
Emp. Form.C63H86N13O16PS2
Mol. Mass.1376.538
SMILESC[C@@H](OP(O)(O)=O)[C@@H](NC(=O)[C@H](Cc1csc2ccccc12)NC(=O)[C@H](C)NC(=O)[C@H](C)NC(=O)[C@H](CCCCNC(=O)CCCC[C@@H]1SC[C@@H]2NC(=O)N[C@H]12)NC(C)=O)C(=O)N1CCCC[C@H]1C(=O)N[C@@H](Cc1ccc2ccccc2c1)C(=O)N[C@@H](CCC(N)=O)C(N)=O