Reaction Details
TargetPeptidyl-prolyl cis-trans isomerase NIMA-interacting 1
LigandBDBM50184841
Substrate/Competitorn/a
Meas. Tech.ChEMBL_342610 (CHEMBL861259)
Ki 18.3±n/a nM
Citation Wildemann, DErdmann, FAlvarez, BHStoller, GZhou, XZFanghänel, JSchutkowski, MLu, KPFischer, G Nanomolar inhibitors of the peptidyl prolyl cis/trans isomerase Pin1 from combinatorial peptide libraries. J Med Chem49:2147-50 (2006) 
 
Peptidyl-prolyl cis-trans isomerase NIMA-interacting 1
Name:Peptidyl-prolyl cis-trans isomerase NIMA-interacting 1
Type:PROTEIN
Mol. Mass.:18248.11
Organism:Homo sapiens (Human)
Description:ChEMBL_1502595
Residue:163
BDBM50184841
NameBDBM50184841
Synonyms:Ac-Phe-D-Thr(PO3H2)-Pip-Nal-Gln-NH2 | CHEMBL436759
TypeSmall organic molecule
Emp. Form.C39H50N7O11P
Mol. Mass.823.8284
SMILESC[C@H](OP(O)(O)=O)[C@@H](NC(=O)[C@H](Cc1ccccc1)NC(C)=O)C(=O)N1CCCC[C@@H]1C(=O)N[C@@H](Cc1ccc2ccccc2c1)C(=O)N[C@@H](CCC(N)=O)C(N)=O