Reaction Details
TargetMast/stem cell growth factor receptor Kit
LigandBDBM13530
Substrate/Competitorn/a
Meas. Tech.ChEMBL_341998 (CHEMBL860934)
IC50 219±n/a nM
Citation Furuta, TSakai, TSenga, TOsawa, TKubo, KShimizu, TSuzuki, RYoshino, TEndo, MMiwa, A Identification of potent and selective inhibitors of PDGF receptor autophosphorylation. J Med Chem49:2186-92 (2006) 
 
Mast/stem cell growth factor receptor Kit
Name:Mast/stem cell growth factor receptor Kit
Type:Protein
Mol. Mass.:109869.37
Organism:Homo sapiens (Human)
Description:P10721
Residue:976
BDBM13530
NameBDBM13530
Synonyms:4-[(4-methylpiperazin-1-yl)methyl]-N-[4-methyl-3-[(4-pyridin-3-ylpyrimidin-2-yl)amino]phenyl]benzamide Gleevec Imatinib, 21 STI-571 US10906896, Cpd imatinib US11725005, Compound imatinib cid_5291 med.21724, Compound 6
TypeSmall organic molecule
Emp. Form.C29H31N7O
Mol. Mass.493.6027
SMILESCN1CCN(Cc2ccc(cc2)C(=O)Nc2ccc(C)c(Nc3nccc(n3)-c3cccnc3)c2)CC1