Reaction Details
TargetMelanin-concentrating hormone receptor 1
LigandBDBM50184913
Substrate/Competitorn/a
Meas. Tech.ChEMBL_342542 (CHEMBL861585)
Ki 3.5±n/a nM
Citation McBriar, MDGuzik, HShapiro, SParuchova, JXu, RPalani, AClader, JWCox, KGreenlee, WJHawes, BEKowalski, TJO'neill, KSpar, BDWeig, BWeston, DJFarley, CCook, J Discovery of orally efficacious melanin-concentrating hormone receptor-1 antagonists as antiobesity agents. Synthesis, SAR, and biological evaluation of bicyclo[3.1.0]hexyl ureas. J Med Chem49:2294-310 (2006) 
 
Melanin-concentrating hormone receptor 1
Name:Melanin-concentrating hormone receptor 1
Type:G Protein-Coupled Receptor (GPCR)
Mol. Mass.:45976.27
Organism:Homo sapiens (Human)
Description:Membranes from CHO-K1 cells stably expressing human MCH1R were used in assays.
Residue:422
BDBM50184913
NameBDBM50184913
Synonyms:CHEMBL205838 | N-[trans-5-(4-cyano-3-fluorophenyl)bicyclo[3.1.0]hex-2-yl]-N'-[4-fluoro-3-(trifluoromethyl)phenyl)-N-[3-(4-methyl-1-piperazinyl)propyl]urea
TypeSmall organic molecule
Emp. Form.C29H32F5N5O
Mol. Mass.561.5893
SMILESCN1CCN(CCCN([C@@H]2CC[C@@]3(C[C@H]23)c2ccc(C#N)c(F)c2)C(=O)Nc2ccc(F)c(c2)C(F)(F)F)CC1