Reaction Details
TargetMelanin-concentrating hormone receptor 1
LigandBDBM50184919
Substrate/Competitorn/a
Meas. Tech.ChEMBL_342542 (CHEMBL861585)
Ki 2.5±n/a nM
Citation McBriar, MDGuzik, HShapiro, SParuchova, JXu, RPalani, AClader, JWCox, KGreenlee, WJHawes, BEKowalski, TJO'neill, KSpar, BDWeig, BWeston, DJFarley, CCook, J Discovery of orally efficacious melanin-concentrating hormone receptor-1 antagonists as antiobesity agents. Synthesis, SAR, and biological evaluation of bicyclo[3.1.0]hexyl ureas. J Med Chem49:2294-310 (2006) 
 
Melanin-concentrating hormone receptor 1
Name:Melanin-concentrating hormone receptor 1
Type:G Protein-Coupled Receptor (GPCR)
Mol. Mass.:45976.27
Organism:Homo sapiens (Human)
Description:Membranes from CHO-K1 cells stably expressing human MCH1R were used in assays.
Residue:422
BDBM50184919
NameBDBM50184919
Synonyms:CHEMBL208025 | N-[trans-5-(3-cyanophenyl)bicyclo[3.1.0]hex-2-yl]-N'-[4-fluoro-3-(trifluoromethyl)phenyl)-N-[4-(4-morpholinyl)butyl]urea
TypeSmall organic molecule
Emp. Form.C29H32F4N4O2
Mol. Mass.544.5836
SMILESFc1ccc(NC(=O)N(CCCCN2CCOCC2)[C@@H]2CC[C@@]3(C[C@H]23)c2cccc(c2)C#N)cc1C(F)(F)F