Reaction Details
TargetMelanin-concentrating hormone receptor 1
LigandBDBM50184948
Substrate/Competitorn/a
Meas. Tech.ChEMBL_342542 (CHEMBL861585)
Ki 2.3±n/a nM
Citation McBriar, MDGuzik, HShapiro, SParuchova, JXu, RPalani, AClader, JWCox, KGreenlee, WJHawes, BEKowalski, TJO'neill, KSpar, BDWeig, BWeston, DJFarley, CCook, J Discovery of orally efficacious melanin-concentrating hormone receptor-1 antagonists as antiobesity agents. Synthesis, SAR, and biological evaluation of bicyclo[3.1.0]hexyl ureas. J Med Chem49:2294-310 (2006) 
 
Melanin-concentrating hormone receptor 1
Name:Melanin-concentrating hormone receptor 1
Type:G Protein-Coupled Receptor (GPCR)
Mol. Mass.:45976.27
Organism:Homo sapiens (Human)
Description:Membranes from CHO-K1 cells stably expressing human MCH1R were used in assays.
Residue:422
BDBM50184948
NameBDBM50184948
Synonyms:CHEMBL206616 | N-[trans-5-(3-fluorophenyl)bicyclo[3.1.0]hex-2-yl]-N'-[4-fluoro-3-(trifluoromethyl)phenyl)-N-[3-(4-methyl-1-piperazinyl)propyl]-urea
TypeSmall organic molecule
Emp. Form.C28H33F5N4O
Mol. Mass.536.5798
SMILESCN1CCN(CCCN([C@@H]2CC[C@@]3(C[C@H]23)c2cccc(F)c2)C(=O)Nc2ccc(F)c(c2)C(F)(F)F)CC1