Reaction Details
TargetFatty-acid amide hydrolase 1 [30-579]
LigandBDBM50185012
Substrate/Competitorn/a
Meas. Tech.ChEMBL_342907 (CHEMBL863817)
IC50>50000±n/a nM
Citation Schiano Moriello, ABalas, LLigresti, ACascio, MGDurand, TMorera, EOrtar, GDi Marzo, V Development of the first potential covalent inhibitors of anandamide cellular uptake. J Med Chem49:2320-32 (2006) 
 
Fatty-acid amide hydrolase 1 [30-579]
Name:Fatty-acid amide hydrolase 1 [30-579]
Type:Single-pass membrane protein; homodimer
Mol. Mass.:60474.00
Organism:Rattus norvegicus (rat)
Description:P97612 (aa 30-579)
Residue:550
BDBM50185012
NameBDBM50185012
Synonyms:(Z)-N-{(1R)-3-iodo-1-[(4-hydroxyphenyl)methyl]propan-2-one}-9-octadecenamide | CHEMBL203949
TypeSmall organic molecule
Emp. Form.C28H44INO3
Mol. Mass.569.5583
SMILESCCCCCCCC\C=C/CCCCCCCC(=O)N[C@H](Cc1ccc(O)cc1)C(=O)CI