Reaction Details
TargetTransient receptor potential cation channel subfamily V member 1
LigandBDBM50185034
Substrate/Competitorn/a
Meas. Tech.ChEMBL_342816 (CHEMBL868829)
EC50 250±n/a nM
Citation Appendino, GMinassi, ABerton, LMoriello, ASCascio, MGDe Petrocellis, LDi Marzo, V Oxyhomologues of anandamide and related endolipids: chemoselective synthesis and biological activity. J Med Chem49:2333-8 (2006) 
 
Transient receptor potential cation channel subfamily V member 1
Name:Transient receptor potential cation channel subfamily V member 1
Type:Protein
Mol. Mass.:94960.75
Organism:Homo sapiens (Human)
Description:Q8NER1
Residue:839
BDBM50185034
NameBDBM50185034
Synonyms:CHEMBL382444 | N-arachidonoyl-O-(2-hydroxyethyl)hydroxylamine
TypeSmall organic molecule
Emp. Form.C22H37NO3
Mol. Mass.363.5341
SMILESCCCCC\C=C/C\C=C/C\C=C/C\C=C/CCCC(=O)NOCCO