Reaction Details
TargetCannabinoid receptor 2
LigandBDBM29080
Substrate/Competitorn/a
Meas. Tech.ChEMBL_342813 (CHEMBL868884)
Ki>10000±n/a nM
Citation Appendino, GMinassi, ABerton, LMoriello, ASCascio, MGDe Petrocellis, LDi Marzo, V Oxyhomologues of anandamide and related endolipids: chemoselective synthesis and biological activity. J Med Chem49:2333-8 (2006) 
 
Cannabinoid receptor 2
Name:Cannabinoid receptor 2
Type:G Protein-Coupled Receptor (GPCR)
Mol. Mass.:39690.94
Organism:Homo sapiens (Human)
Description:P34972
Residue:360
BDBM29080
NameBDBM29080
Synonyms:CHEMBL280065 Oleamide MEA Oleoylethanolamide (OEA)
Typen/a
Emp. Form.C20H39NO2
Mol. Mass.325.5292
SMILESCCCCCCCC\C=C/CCCCCCCC(=O)NCCO