Reaction Details
TargetCannabinoid receptor 2
LigandBDBM50185033
Substrate/Competitorn/a
Meas. Tech.ChEMBL_342813 (CHEMBL868884)
Ki 3800±n/a nM
Citation Appendino, GMinassi, ABerton, LMoriello, ASCascio, MGDe Petrocellis, LDi Marzo, V Oxyhomologues of anandamide and related endolipids: chemoselective synthesis and biological activity. J Med Chem49:2333-8 (2006) 
 
Cannabinoid receptor 2
Name:Cannabinoid receptor 2
Type:G Protein-Coupled Receptor (GPCR)
Mol. Mass.:39690.94
Organism:Homo sapiens (Human)
Description:P34972
Residue:360
BDBM50185033
NameBDBM50185033
Synonyms:CHEMBL208270 | N-oleoyl-O-(2-hydroxyethyl)hydroxylamine
TypeSmall organic molecule
Emp. Form.C20H39NO3
Mol. Mass.341.5286
SMILESCCCCCCCC\C=C/CCCCCCCC(=O)NOCCO