Reaction Details
TargetMelanin-concentrating hormone receptor 1
LigandBDBM50173460
Substrate/Competitorn/a
Meas. Tech.ChEMBL_343377 (CHEMBL860697)
IC50 2±n/a nM
Citation Kym, PRSouers, AJCampbell, TJLynch, JKJudd, ASIyengar, RVasudevan, AGao, JFreeman, JCWodka, DMulhern, MZhao, GWagaw, SHNapier, JJBrodjian, SDayton, BDReilly, RMSegreti, JAFryer, RMPreusser, LCReinhart, GAHernandez, LMarsh, KCSham, HLCollins, CAPolakowski, JS Screening for cardiovascular safety: a structure-activity approach for guiding lead selection of melanin concentrating hormone receptor 1 antagonists. J Med Chem49:2339-52 (2006) 
 
Melanin-concentrating hormone receptor 1
Name:Melanin-concentrating hormone receptor 1
Type:G Protein-Coupled Receptor (GPCR)
Mol. Mass.:45976.27
Organism:Homo sapiens (Human)
Description:Membranes from CHO-K1 cells stably expressing human MCH1R were used in assays.
Residue:422
BDBM50173460
NameBDBM50173460
Synonyms:4-(1-(benzo[d][1,3]dioxol-5-ylmethyl)piperidin-4-ylamino)-6-methoxy-2H-chromen-2-one CHEMBL196208
TypeSmall organic molecule
Emp. Form.C23H24N2O5
Mol. Mass.408.4471
SMILESCOc1ccc2oc(=O)cc(NC3CCN(Cc4ccc5OCOc5c4)CC3)c2c1