Reaction Details
TargetMelanin-concentrating hormone receptor 1
LigandBDBM50185044
Substrate/Competitorn/a
Meas. Tech.ChEMBL_343377 (CHEMBL860697)
IC50 5±n/a nM
Citation Kym, PRSouers, AJCampbell, TJLynch, JKJudd, ASIyengar, RVasudevan, AGao, JFreeman, JCWodka, DMulhern, MZhao, GWagaw, SHNapier, JJBrodjian, SDayton, BDReilly, RMSegreti, JAFryer, RMPreusser, LCReinhart, GAHernandez, LMarsh, KCSham, HLCollins, CAPolakowski, JS Screening for cardiovascular safety: a structure-activity approach for guiding lead selection of melanin concentrating hormone receptor 1 antagonists. J Med Chem49:2339-52 (2006) 
 
Melanin-concentrating hormone receptor 1
Name:Melanin-concentrating hormone receptor 1
Type:G Protein-Coupled Receptor (GPCR)
Mol. Mass.:45976.27
Organism:Homo sapiens (Human)
Description:Membranes from CHO-K1 cells stably expressing human MCH1R were used in assays.
Residue:422
BDBM50185044
NameBDBM50185044
Synonyms:CHEMBL383078 | N-(4-phenoxyphenyl)-N'-[1-(2-piperidin-1-ylethyl)-1H-indazol-5-yl]urea
TypeSmall organic molecule
Emp. Form.C27H29N5O2
Mol. Mass.455.5515
SMILESO=C(Nc1ccc(Oc2ccccc2)cc1)Nc1ccc2n(CCN3CCCCC3)ncc2c1