Reaction Details
TargetSphingosine 1-phosphate receptor 3
LigandBDBM50185141
Substrate/Competitorn/a
Meas. Tech.ChEMBL_358032 (CHEMBL853138)
IC50 2500±n/a nM
Citation Colandrea, VJLegiec, IEHuo, PYan, LHale, JJMills, SGBergstrom, JCard, DChebret, GHajdu, RKeohane, CAMilligan, JARosenbach, MJShei, GJMandala, SM 2,5-Disubstituted pyrrolidine carboxylates as potent, orally active sphingosine-1-phosphate (S1P) receptor agonists. Bioorg Med Chem Lett16:2905-8 (2006) 
 
Sphingosine 1-phosphate receptor 3
Name:Sphingosine 1-phosphate receptor 3
Type:G Protein-Coupled Receptor (GPCR)
Mol. Mass.:42278.13
Organism:Homo sapiens (Human)
Description:Q99500
Residue:378
BDBM50185141
NameBDBM50185141
Synonyms:(+/-)-2-(cis-5-(4-(5-(4-((R)-3,3-difluorocyclopentyl)phenyl)-1,2,4-oxadiazol-3-yl)phenyl)pyrrolidin-2-yl)acetic acid CHEMBL209076
TypeSmall organic molecule
Emp. Form.C25H25F2N3O3
Mol. Mass.453.4811
SMILESOC(=O)C[C@@H]1CC[C@@H](N1)c1ccc(cc1)-c1noc(n1)-c1ccc(cc1)[C@@H]1CCC(F)(F)C1