Reaction Details
TargetSphingosine 1-phosphate receptor 4
LigandBDBM50185147
Substrate/Competitorn/a
Meas. Tech.ChEMBL_358033 (CHEMBL871182)
IC50 2100±n/a nM
Citation Colandrea, VJLegiec, IEHuo, PYan, LHale, JJMills, SGBergstrom, JCard, DChebret, GHajdu, RKeohane, CAMilligan, JARosenbach, MJShei, GJMandala, SM 2,5-Disubstituted pyrrolidine carboxylates as potent, orally active sphingosine-1-phosphate (S1P) receptor agonists. Bioorg Med Chem Lett16:2905-8 (2006) 
 
Sphingosine 1-phosphate receptor 4
Name:Sphingosine 1-phosphate receptor 4
Type:G Protein-Coupled Receptor (GPCR)
Mol. Mass.:41647.39
Organism:Homo sapiens (Human)
Description:n/a
Residue:384
BDBM50185147
NameBDBM50185147
Synonyms:(+/-)-2-(cis-5-(4-(5-(4-cyclopentyl-3-fluorophenyl)-1,2,4-oxadiazol-3-yl)phenyl)pyrrolidin-2-yl)acetic acid | CHEMBL426688
TypeSmall organic molecule
Emp. Form.C25H26FN3O3
Mol. Mass.435.4906
SMILESOC(=O)C[C@@H]1CC[C@@H](N1)c1ccc(cc1)-c1noc(n1)-c1ccc(C2CCCC2)c(F)c1