Reaction Details
TargetSphingosine 1-phosphate receptor 1
LigandBDBM50185141
Substrate/Competitorn/a
Meas. Tech.ChEMBL_358030 (CHEMBL866347)
IC50 1.20±n/a nM
Citation Colandrea, VJLegiec, IEHuo, PYan, LHale, JJMills, SGBergstrom, JCard, DChebret, GHajdu, RKeohane, CAMilligan, JARosenbach, MJShei, GJMandala, SM 2,5-Disubstituted pyrrolidine carboxylates as potent, orally active sphingosine-1-phosphate (S1P) receptor agonists. Bioorg Med Chem Lett16:2905-8 (2006) 
 
Sphingosine 1-phosphate receptor 1
Name:Sphingosine 1-phosphate receptor 1
Type:Enzyme
Mol. Mass.:42836.02
Organism:Homo sapiens (Human)
Description:P21453
Residue:382
BDBM50185141
NameBDBM50185141
Synonyms:(+/-)-2-(cis-5-(4-(5-(4-((R)-3,3-difluorocyclopentyl)phenyl)-1,2,4-oxadiazol-3-yl)phenyl)pyrrolidin-2-yl)acetic acid CHEMBL209076
TypeSmall organic molecule
Emp. Form.C25H25F2N3O3
Mol. Mass.453.4811
SMILESOC(=O)C[C@@H]1CC[C@@H](N1)c1ccc(cc1)-c1noc(n1)-c1ccc(cc1)[C@@H]1CCC(F)(F)C1