Reaction Details
TargetSphingosine 1-phosphate receptor 2
LigandBDBM50185145
Substrate/Competitorn/a
Meas. Tech.ChEMBL_358031 (CHEMBL853137)
IC50>10000±n/a nM
Citation Colandrea, VJLegiec, IEHuo, PYan, LHale, JJMills, SGBergstrom, JCard, DChebret, GHajdu, RKeohane, CAMilligan, JARosenbach, MJShei, GJMandala, SM 2,5-Disubstituted pyrrolidine carboxylates as potent, orally active sphingosine-1-phosphate (S1P) receptor agonists. Bioorg Med Chem Lett16:2905-8 (2006) 
 
Sphingosine 1-phosphate receptor 2
Name:Sphingosine 1-phosphate receptor 2
Type:G Protein-Coupled Receptor (GPCR)
Mol. Mass.:38883.16
Organism:Homo sapiens (Human)
Description:Membranes isolated from S1P2-transfected CHO cells were used in ligand binding assay.
Residue:353
BDBM50185145
NameBDBM50185145
Synonyms:(+/-)-2-(cis-5-(4-(5-(4-((S)-3,3-difluorocyclopentyl)phenyl)-1,2,4-oxadiazol-3-yl)phenyl)pyrrolidin-2-yl)acetic acid | CHEMBL210257
TypeSmall organic molecule
Emp. Form.C25H25F2N3O3
Mol. Mass.453.4811
SMILESOC(=O)C[C@@H]1CC[C@@H](N1)c1ccc(cc1)-c1noc(n1)-c1ccc(cc1)[C@H]1CCC(F)(F)C1