Reaction Details
TargetSphingosine 1-phosphate receptor 2
LigandBDBM50185151
Substrate/Competitorn/a
Meas. Tech.ChEMBL_358031 (CHEMBL853137)
IC50>10000±n/a nM
Citation Colandrea, VJLegiec, IEHuo, PYan, LHale, JJMills, SGBergstrom, JCard, DChebret, GHajdu, RKeohane, CAMilligan, JARosenbach, MJShei, GJMandala, SM 2,5-Disubstituted pyrrolidine carboxylates as potent, orally active sphingosine-1-phosphate (S1P) receptor agonists. Bioorg Med Chem Lett16:2905-8 (2006) 
 
Sphingosine 1-phosphate receptor 2
Name:Sphingosine 1-phosphate receptor 2
Type:G Protein-Coupled Receptor (GPCR)
Mol. Mass.:38883.16
Organism:Homo sapiens (Human)
Description:Membranes isolated from S1P2-transfected CHO cells were used in ligand binding assay.
Residue:353
BDBM50185151
NameBDBM50185151
Synonyms:(+/-)-trans-5-(4-(5-(4-isobutylphenyl)-1,2,4-oxadiazol-3-yl)phenyl)pyrrolidine-2-carboxylic acid | CHEMBL427221
TypeSmall organic molecule
Emp. Form.C23H25N3O3
Mol. Mass.391.4629
SMILESCC(C)Cc1ccc(cc1)-c1nc(no1)-c1ccc(cc1)[C@@H]1CC[C@H](N1)C(O)=O